Target
Tyrosine-protein kinase Lyn
Ligand
BDBM50209156
Substrate
Meas. Tech.
ChEMBL_455237 (CHEMBL906398)
IC50
>50000±n/a nM
Citation
 Akritopoulou-Zanze, IAlbert, DHBousquet, PFCunha, GAHarris, CMMoskey, MDinges, JStewart, KDSowin, TJ Synthesis and biological evaluation of 5-substituted 1,4-dihydroindeno[1,2-c]pyrazoles as multitargeted receptor tyrosine kinase inhibitors. Bioorg Med Chem Lett 17:3136-40 (2007)  
Target
Name:
Tyrosine-protein kinase Lyn
Synonyms:
JTK8 LYN_HUMAN Tyrosine-protein kinase Lyn (LYN) p53Lyn | p56Lyn
Type:
Protein
Mol. Mass.:
58575.92
Organism:
Homo sapiens (Human)
Description:
P07948
Residue:
512
  
Inhibitor
Name:
BDBM50209156
Synonyms:
CHEMBL395427 | N-{3-[5-(3-phenoxy-prop-1-ynyl)-thiophen-3-yl]-2,4-dihydro-indeno[1,2-c]pyrazol-5-yl}-malonamic acid ethyl ester
Type:
Small organic molecule
Emp. Form.:
C28H23N3O4S
Mol. Mass.:
497.565
SMILES:
CCOC(=O)CC(=O)Nc1cccc-2c1Cc1c-2n[nH]c1-c1csc(c1)C#CCOc1ccccc1
: