Target
Mast/stem cell growth factor receptor Kit
Ligand
BDBM50209160
Substrate
Meas. Tech.
ChEMBL_455230 (CHEMBL906391)
IC50
1670±n/a nM
Citation
 Akritopoulou-Zanze, IAlbert, DHBousquet, PFCunha, GAHarris, CMMoskey, MDinges, JStewart, KDSowin, TJ Synthesis and biological evaluation of 5-substituted 1,4-dihydroindeno[1,2-c]pyrazoles as multitargeted receptor tyrosine kinase inhibitors. Bioorg Med Chem Lett 17:3136-40 (2007)  
Target
Name:
Mast/stem cell growth factor receptor Kit
Synonyms:
CD117 antigen KIT Mast/stem cell growth factor receptor Kit (cKIT) Proto-oncogene tyrosine-protein kinase Kit Stem cell growth factor receptor Tyrosine-protein kinase Kit c-kit v-kit Hardy-Zuckerman 4 feline sarcoma viral oncogene homolog
Type:
Protein
Mol. Mass.:
109869.37
Organism:
Homo sapiens (Human)
Description:
P10721
Residue:
976
  
Inhibitor
Name:
BDBM50209160
Synonyms:
2-[(3-thiophen-3-yl-2,4-dihydro-indeno[1,2-c]pyrazol-5-ylmethyl)-amino]-ethanol | CHEMBL246546
Type:
Small organic molecule
Emp. Form.:
C17H17N3OS
Mol. Mass.:
311.401
SMILES:
OCCNCc1cccc-2c1Cc1c-2n[nH]c1-c1ccsc1
: