Target
Vascular endothelial growth factor receptor 2
Ligand
BDBM50209159
Substrate
Meas. Tech.
ChEMBL_455228 (CHEMBL906389)
IC50
410±n/a nM
Citation
 Akritopoulou-Zanze, IAlbert, DHBousquet, PFCunha, GAHarris, CMMoskey, MDinges, JStewart, KDSowin, TJ Synthesis and biological evaluation of 5-substituted 1,4-dihydroindeno[1,2-c]pyrazoles as multitargeted receptor tyrosine kinase inhibitors. Bioorg Med Chem Lett 17:3136-40 (2007)  
Target
Name:
Vascular endothelial growth factor receptor 2
Synonyms:
CD_antigen=CD309 Fetal liver kinase 1 (FLK-1) KDR Protein-tyrosine kinase receptor Flk-1 VEGFR-2 VEGFR2 Vascular Endothelial Growth Factor Receptor Kinase 2 Vascular endothelial growth factor receptor 2 (KDR) Vascular endothelial growth factor receptor 2 (VEGFR2) Vascular endothelial growth factor receptor-2 (VEGFR-2)
Type:
Receptor Tyrosine Kinase
Mol. Mass.:
151510.97
Organism:
Homo sapiens (Human)
Description:
P35968
Residue:
1356
  
Inhibitor
Name:
BDBM50209159
Synonyms:
CHEMBL246343 | [(3-thiophen-3-yl-2,4-dihydro-indeno[1,2-c]pyrazole-5-carbonyl)-amino]-acetic acid
Type:
Small organic molecule
Emp. Form.:
C17H13N3O3S
Mol. Mass.:
339.368
SMILES:
OC(=O)CNC(=O)c1cccc-2c1Cc1c-2n[nH]c1-c1ccsc1
: