Target
Baculoviral IAP repeat-containing protein 5
Ligand
BDBM50209195
Substrate
Meas. Tech.
ChEMBL_443470 (CHEMBL893728)
Kd
700±n/a nM
Citation
 Wendt, MDSun, CKunzer, ASauer, DSarris, KHoff, EYu, LNettesheim, DGChen, JJin, SComess, KMFan, YAnderson, SNIsaac, BOlejniczak, ETHajduk, PJRosenberg, SHElmore, SW Discovery of a novel small molecule binding site of human survivin. Bioorg Med Chem Lett 17:3122-9 (2007)  
Target
Name:
Baculoviral IAP repeat-containing protein 5
Synonyms:
API4 Apoptosis inhibitor survivin BIRC5_HUMAN | IAP4
Type:
PROTEIN
Mol. Mass.:
16386.52
Organism:
Homo sapiens (Human)
Description:
ChEMBL_443470
Residue:
142
  
Inhibitor
Name:
BDBM50209195
Synonyms:
4-(2,5-dichloro-phenyl)-6-(4-hydroxy-biphenyl-3-yl)-2-oxo-1,2-dihydro-pyridine-3-carbonitrile | CHEMBL391106
Type:
Small organic molecule
Emp. Form.:
C24H14Cl2N2O2
Mol. Mass.:
433.286
SMILES:
Oc1ccc(cc1-c1cc(-c2cc(Cl)ccc2Cl)c(C#N)c(=O)[nH]1)-c1ccccc1
: