Target
Cholinesterase
Ligand
BDBM50209409
Substrate
Meas. Tech.
ChEMBL_443531 (CHEMBL893788)
Ki
>100000±n/a nM
Citation
 Hicks, LDHyatt, JLMoak, TEdwards, CCTsurkan, LWierdl, MFerreira, AMWadkins, RMPotter, PM Analysis of the inhibition of mammalian carboxylesterases by novel fluorobenzoins and fluorobenzils. Bioorg Med Chem 15:3801-17 (2007)  
Target
Name:
Cholinesterase
Synonyms:
Acylcholine acylhydrolase Butyrylcholine esterase (BChE) Butyrylcholinesterase (BuChE) CHLE_HUMAN Cholinesterases Pseudocholinesterase
Type:
Homotetramer
Mol. Mass.:
68422.27
Organism:
Homo sapiens (Human)
Description:
P06276
Residue:
602
  
Inhibitor
Name:
BDBM50209409
Synonyms:
1,2-bis(4-fluorophenyl)-2-hydroxyethanone | CHEMBL244213
Type:
Small organic molecule
Emp. Form.:
C14H10F2O2
Mol. Mass.:
248.2248
SMILES:
OC(C(=O)c1ccc(F)cc1)c1ccc(F)cc1
: