Target
Liver carboxylesterase 1
Ligand
BDBM22730
Substrate
Meas. Tech.
ChEMBL_443528 (CHEMBL893785)
Ki
230±n/a nM
Citation
 Hicks, LDHyatt, JLMoak, TEdwards, CCTsurkan, LWierdl, MFerreira, AMWadkins, RMPotter, PM Analysis of the inhibition of mammalian carboxylesterases by novel fluorobenzoins and fluorobenzils. Bioorg Med Chem 15:3801-17 (2007)  
Target
Name:
Liver carboxylesterase 1
Synonyms:
Acyl coenzyme A:cholesterol acyltransferase CES1 EST1_HUMAN Serine hydrolase (CES1)
Type:
Protein
Mol. Mass.:
62520.83
Organism:
Homo sapiens (Human)
Description:
Residue:
567
  
Inhibitor
Name:
BDBM22730
Synonyms:
1,2-bis(4-fluorophenyl)ethane-1,2-dione CHEMBL192410
Type:
Small organic molecule
Emp. Form.:
C14H8F2O2
Mol. Mass.:
246.2089
SMILES:
Fc1ccc(cc1)C(=O)C(=O)c1ccc(F)cc1
: