Target
C-C chemokine receptor type 3
Ligand
BDBM50209972
Substrate
Meas. Tech.
ChEMBL_458975 (CHEMBL925070)
IC50
0.075000±n/a nM
Citation
 Pruitt, JRBatt, DGWacker, DABostrom, LLBooker, SKMcLaughlin, EHoughton, GCVarnes, JGChrist, DDCovington, MDas, AMDavies, PGraden, DKariv, IOrlovsky, YStowell, NCVaddi, KGWadman, EAWelch, PKYeleswaram, SSolomon, KANewton, RCDecicco, CPCarter, PHKo, SS CC chemokine receptor-3 (CCR3) antagonists: improving the selectivity of DPC168 by reducing central ring lipophilicity. Bioorg Med Chem Lett 17:2992-7 (2007)  
Target
Name:
C-C chemokine receptor type 3
Synonyms:
C-C CKR-3 CC-CKR-3 CCR3 CD_antigen=CD193 CMKBR3 | Eosinophil eotaxin receptor
Type:
Enzyme
Mol. Mass.:
41053.88
Organism:
Homo sapiens (Human)
Description:
P51677
Residue:
355
  
Inhibitor
Name:
BDBM50209972
Synonyms:
1-((3S,4S)-4-(((S)-3-(4-fluorobenzyl)piperidin-1-yl)methyl)piperidin-3-yl)-3-(5-acetyl-4-methylthiazol-2-yl)urea | CHEMBL251079
Type:
Small organic molecule
Emp. Form.:
C25H34FN5O2S
Mol. Mass.:
487.633
SMILES:
CC(=O)c1sc(NC(=O)N[C@@H]2CNCC[C@H]2CN2CCC[C@@H](Cc3ccc(F)cc3)C2)nc1C
: