Target
5-hydroxytryptamine receptor 2A
Ligand
BDBM50210091
Substrate
Meas. Tech.
ChEMBL_443936 (CHEMBL893102)
IC50
2.6±n/a nM
Citation
 Feng, ZMohapatra, SKlimko, PGHellberg, MRMay, JAKelly, CWilliams, GMcLaughlin, MASharif, NA Novel benzodifuran analogs as potent 5-HT2A receptor agonists with ocular hypotensive activity. Bioorg Med Chem Lett 17:2998-3002 (2007)  
Target
Name:
5-hydroxytryptamine receptor 2A
Synonyms:
5-HT-2A 5-HT2A 5-hydroxytryptamine receptor 2A (5HT2A) Htr2 Serotonin Receptor 2A
Type:
G Protein-Coupled Receptor (GPCR)
Mol. Mass.:
52852.05
Organism:
Rattus norvegicus (rat)
Description:
Rat cortex membranes 5-HT2A receptors.
Residue:
471
  
Inhibitor
Name:
BDBM50210091
Synonyms:
(1S,2R)-2-amino-1-(8-bromo-2,3,6,7-tetrahydro-benzo[1,2-b;4,5-b']difuran-4-yl)-propan-1-ol | CHEMBL234683
Type:
Small organic molecule
Emp. Form.:
C13H16BrNO3
Mol. Mass.:
314.175
SMILES:
C[C@@H](N)[C@@H](O)c1c2CCOc2c(Br)c2CCOc12
: