Target
Chymase
Ligand
BDBM50210113
Substrate
Meas. Tech.
ChEMBL_455355 (CHEMBL886130)
IC50
83±n/a nM
Citation
 Tanaka, TMuto, TMaruoka, HImajo, SFukami, HTomimori, YFukuda, YNakatsuka, T Identification of 6-substituted 4-arylsulfonyl-1,4-diazepane-2,5-diones as a novel scaffold for human chymase inhibitors. Bioorg Med Chem Lett 17:3431-4 (2007)  
Target
Name:
Chymase
Synonyms:
Alpha-chymase CMA1_HUMAN CYM Mast cell protease I
Type:
Enzyme
Mol. Mass.:
27340.12
Organism:
Homo sapiens (Human)
Description:
Residue:
247
  
Inhibitor
Name:
BDBM50210113
Synonyms:
6-(5-chloro-2-ethoxybenzyl)-4-(4-chlorophenylsulfonyl)-1,4-diazepane-2,5-dione | CHEMBL246762
Type:
Small organic molecule
Emp. Form.:
C20H20Cl2N2O5S
Mol. Mass.:
471.354
SMILES:
CCOc1ccc(Cl)cc1CC1CNC(=O)CN(C1=O)S(=O)(=O)c1ccc(Cl)cc1
: