Target
Chymase
Ligand
BDBM50210116
Substrate
Meas. Tech.
ChEMBL_455355 (CHEMBL886130)
IC50
26±n/a nM
Citation
 Tanaka, TMuto, TMaruoka, HImajo, SFukami, HTomimori, YFukuda, YNakatsuka, T Identification of 6-substituted 4-arylsulfonyl-1,4-diazepane-2,5-diones as a novel scaffold for human chymase inhibitors. Bioorg Med Chem Lett 17:3431-4 (2007)  
Target
Name:
Chymase
Synonyms:
Alpha-chymase CMA1_HUMAN CYM Mast cell protease I
Type:
Enzyme
Mol. Mass.:
27340.12
Organism:
Homo sapiens (Human)
Description:
Residue:
247
  
Inhibitor
Name:
BDBM50210116
Synonyms:
6-(5-fluoro-2-methoxybenzyl)-4-(4-chlorophenylsulfonyl)-1,4-diazepane-2,5-dione | CHEMBL246965
Type:
Small organic molecule
Emp. Form.:
C19H18ClFN2O5S
Mol. Mass.:
440.873
SMILES:
COc1ccc(F)cc1CC1CNC(=O)CN(C1=O)S(=O)(=O)c1ccc(Cl)cc1
: