Target
Cathepsin G
Ligand
BDBM100740
Substrate
Meas. Tech.
ChEMBL_455357 (CHEMBL886132)
IC50
2900±n/a nM
Citation
 Tanaka, TMuto, TMaruoka, HImajo, SFukami, HTomimori, YFukuda, YNakatsuka, T Identification of 6-substituted 4-arylsulfonyl-1,4-diazepane-2,5-diones as a novel scaffold for human chymase inhibitors. Bioorg Med Chem Lett 17:3431-4 (2007)  
Target
Name:
Cathepsin G
Synonyms:
CATG_HUMAN CTSG
Type:
PROTEIN
Mol. Mass.:
28860.08
Organism:
Homo sapiens (Human)
Description:
ChEMBL_1469016
Residue:
255
  
Inhibitor
Name:
BDBM100740
Synonyms:
CHEMBL391608 | US8507714, 29
Type:
Small organic molecule
Emp. Form.:
C19H18Cl2N2O5S
Mol. Mass.:
457.328
SMILES:
COc1ccc(Cl)cc1CC1CNC(=O)CN(C1=O)S(=O)(=O)c1ccc(Cl)cc1
: