Target
Tyrosine-protein kinase Fyn
Ligand
BDBM50210271
Substrate
Meas. Tech.
ChEMBL_434554 (CHEMBL914201)
IC50
>50000±n/a nM
Citation
 Dinges, JAlbert, DHArnold, LDAshworth, KLAkritopoulou-Zanze, IBousquet, PFBouska, JJCunha, GADavidsen, SKDiaz, GJDjuric, SWGasiecki, AFGintant, GAGracias, VJHarris, CMHouseman, KAHutchins, CWJohnson, EFLi, HMarcotte, PAMartin, RLMichaelides, MRNyein, MSowin, TJSu, ZTapang, PHXia, ZZhang, HQ 1,4-Dihydroindeno[1,2-c]pyrazoles with acetylenic side chains as novel and potent multitargeted receptor tyrosine kinase inhibitors with low affinity for the hERG ion channel. J Med Chem 50:2011-29 (2007)  
Target
Name:
Tyrosine-protein kinase Fyn
Synonyms:
FYN Proto-oncogene Syn SLK Src-like kinase | p59-Fyn
Type:
Enzyme
Mol. Mass.:
60762.21
Organism:
Homo sapiens (Human)
Description:
P06241
Residue:
537
  
Inhibitor
Name:
BDBM50210271
Synonyms:
7-((1H-1,2,4-triazol-1-yl)methyl)-3-(5-(3-(2-methoxyethoxy)-prop-1-ynyl)thiophen-3-yl)-1,4-dihydroindeno[1,2-c]pyrazole | CHEMBL223971
Type:
Small organic molecule
Emp. Form.:
C23H21N5O2S
Mol. Mass.:
431.51
SMILES:
COCCOCC#Cc1cc(cs1)-c1[nH]nc-2c1Cc1ccc(Cn3cncn3)cc-21
: