Target
Vascular endothelial growth factor receptor 2
Ligand
BDBM50210284
Substrate
Meas. Tech.
ChEMBL_434530 (CHEMBL914746)
IC50
42±n/a nM
Citation
 Dinges, JAlbert, DHArnold, LDAshworth, KLAkritopoulou-Zanze, IBousquet, PFBouska, JJCunha, GADavidsen, SKDiaz, GJDjuric, SWGasiecki, AFGintant, GAGracias, VJHarris, CMHouseman, KAHutchins, CWJohnson, EFLi, HMarcotte, PAMartin, RLMichaelides, MRNyein, MSowin, TJSu, ZTapang, PHXia, ZZhang, HQ 1,4-Dihydroindeno[1,2-c]pyrazoles with acetylenic side chains as novel and potent multitargeted receptor tyrosine kinase inhibitors with low affinity for the hERG ion channel. J Med Chem 50:2011-29 (2007)  
Target
Name:
Vascular endothelial growth factor receptor 2
Synonyms:
CD_antigen=CD309 Fetal liver kinase 1 (FLK-1) KDR Protein-tyrosine kinase receptor Flk-1 VEGFR-2 VEGFR2 Vascular Endothelial Growth Factor Receptor Kinase 2 Vascular endothelial growth factor receptor 2 (KDR) Vascular endothelial growth factor receptor 2 (VEGFR2) Vascular endothelial growth factor receptor-2 (VEGFR-2)
Type:
Receptor Tyrosine Kinase
Mol. Mass.:
151510.97
Organism:
Homo sapiens (Human)
Description:
P35968
Residue:
1356
  
Inhibitor
Name:
BDBM50210284
Synonyms:
CHEMBL374690 | N,N-dimethyl-2-(3-(5-(3-phenoxyprop-1-ynyl)thiophen-3-yl)-1,4-dihydroindeno[1,2-c]pyrazol-6-yloxy)acetamide
Type:
Small organic molecule
Emp. Form.:
C27H23N3O3S
Mol. Mass.:
469.555
SMILES:
CN(C)C(=O)COc1ccc-2c(Cc3c-2n[nH]c3-c2csc(c2)C#CCOc2ccccc2)c1
: