Target
Vascular endothelial growth factor receptor 2
Ligand
BDBM50210317
Substrate
Meas. Tech.
ChEMBL_434530 (CHEMBL914746)
IC50
2370±n/a nM
Citation
 Dinges, JAlbert, DHArnold, LDAshworth, KLAkritopoulou-Zanze, IBousquet, PFBouska, JJCunha, GADavidsen, SKDiaz, GJDjuric, SWGasiecki, AFGintant, GAGracias, VJHarris, CMHouseman, KAHutchins, CWJohnson, EFLi, HMarcotte, PAMartin, RLMichaelides, MRNyein, MSowin, TJSu, ZTapang, PHXia, ZZhang, HQ 1,4-Dihydroindeno[1,2-c]pyrazoles with acetylenic side chains as novel and potent multitargeted receptor tyrosine kinase inhibitors with low affinity for the hERG ion channel. J Med Chem 50:2011-29 (2007)  
Target
Name:
Vascular endothelial growth factor receptor 2
Synonyms:
CD_antigen=CD309 Fetal liver kinase 1 (FLK-1) KDR Protein-tyrosine kinase receptor Flk-1 VEGFR-2 VEGFR2 Vascular Endothelial Growth Factor Receptor Kinase 2 Vascular endothelial growth factor receptor 2 (KDR) Vascular endothelial growth factor receptor 2 (VEGFR2) Vascular endothelial growth factor receptor-2 (VEGFR-2)
Type:
Receptor Tyrosine Kinase
Mol. Mass.:
151510.97
Organism:
Homo sapiens (Human)
Description:
P35968
Residue:
1356
  
Inhibitor
Name:
BDBM50210317
Synonyms:
2-methyl-5-(4-(6-((4-methylpiperazin-1-yl)methyl)-1,4-dihydroindeno[1,2-c]pyrazol-3-yl)thiophen-2-yl)pent-4-yn-2-ol | CHEMBL374627
Type:
Small organic molecule
Emp. Form.:
C26H30N4OS
Mol. Mass.:
446.608
SMILES:
CN1CCN(Cc2ccc-3c(Cc4c-3n[nH]c4-c3csc(c3)C#CCC(C)(C)O)c2)CC1
: