Target
Potassium voltage-gated channel subfamily H member 2
Ligand
BDBM50210314
Substrate
Meas. Tech.
ChEMBL_434542 (CHEMBL914758)
IC50
2100±n/a nM
Citation
 Dinges, JAlbert, DHArnold, LDAshworth, KLAkritopoulou-Zanze, IBousquet, PFBouska, JJCunha, GADavidsen, SKDiaz, GJDjuric, SWGasiecki, AFGintant, GAGracias, VJHarris, CMHouseman, KAHutchins, CWJohnson, EFLi, HMarcotte, PAMartin, RLMichaelides, MRNyein, MSowin, TJSu, ZTapang, PHXia, ZZhang, HQ 1,4-Dihydroindeno[1,2-c]pyrazoles with acetylenic side chains as novel and potent multitargeted receptor tyrosine kinase inhibitors with low affinity for the hERG ion channel. J Med Chem 50:2011-29 (2007)  
Target
Name:
Potassium voltage-gated channel subfamily H member 2
Synonyms:
1,3-beta-glucan synthase component GLS2 ERG Eag-related protein 1 Ether-a-go-go-related gene (HERG) Ether-a-go-go-related gene potassium channel 1 Ether-a-go-go-related gene potassium channel 1 (hERG1) Ether-a-go-go-related protein 1 H-ERG KCNH2 Potassium voltage-gated channel subfamily H member 2 (hERG) Voltage-gated potassium channel subunit Kv11.1 hERG Potassium Channel 1 | putative potassium channel subunit
Type:
Multi-pass membrane protein
Mol. Mass.:
126672.65
Organism:
Homo sapiens (Human)
Description:
Q12809
Residue:
1159
  
Inhibitor
Name:
BDBM50210314
Synonyms:
6-((1-methylpiperidin-4-yl)methyl)-3-(5-(3-phenoxyprop-1-ynyl)thiophen-3 -yl)-1,4-dihydroindeno[1,2-c]pyrazole | CHEMBL223999
Type:
Small organic molecule
Emp. Form.:
C30H29N3OS
Mol. Mass.:
479.636
SMILES:
CN1CCC(Cc2ccc-3c(Cc4c-3n[nH]c4-c3csc(c3)C#CCOc3ccccc3)c2)CC1
: