Target
Carbonic anhydrase 2
Ligand
BDBM50210910
Substrate
Meas. Tech.
ChEMBL_444150 (CHEMBL893309)
Kd
322±n/a nM
Citation
 Dudutiene, VBaranauskiene, LMatulis, D Benzimidazo[1,2-c][1,2,3]thiadiazole-7-sulfonamides as inhibitors of carbonic anhydrase. Bioorg Med Chem Lett 17:3335-8 (2007)  
Target
Name:
Carbonic anhydrase 2
Synonyms:
CA2 Carbonic anhydrase Carbonic anhydrase II Carbonic anhydrase II (CA-II)
Type:
Enzyme Catalytic Domain
Mol. Mass.:
29115.93
Organism:
Bos taurus
Description:
Residue:
260
  
Inhibitor
Name:
BDBM50210910
Synonyms:
3-methylthiobenzimidazo[1,2-c][1,2,3]thiadiazol-7-sulfonamide CHEMBL395543
Type:
Small organic molecule
Emp. Form.:
C9H8N4O2S3
Mol. Mass.:
300.38
SMILES:
CSC1=S=Nn2c1nc1ccc(cc21)S(N)(=O)=O
: