Target
C-C chemokine receptor type 1
Ligand
BDBM50210976
Substrate
Meas. Tech.
ChEMBL_444182 (CHEMBL892290)
IC50
8±n/a nM
Citation
 Xie, YFLake, KLigsay, KKomandla, MSircar, INagarajan, GLi, JXu, KParise, JSchneider, LHuang, DLiu, JDines, KSakurai, NBarbosa, MJack, R Structure-activity relationships of novel, highly potent, selective, and orally active CCR1 antagonists. Bioorg Med Chem Lett 17:3367-72 (2007)  
Target
Name:
C-C chemokine receptor type 1
Synonyms:
C-C CKR-1 CC-CKR-1 CCR1 CD_antigen=CD191 CMKR1 LD78 receptor Macrophage inflammatory protein 1-alpha receptor SCYAR1
Type:
Enzyme
Mol. Mass.:
41180.69
Organism:
Homo sapiens (Human)
Description:
P32246
Residue:
355
  
Inhibitor
Name:
BDBM50210976
Synonyms:
(R)-3-(2-(2-(4-(4-fluorobenzyl)-2-methylpiperazin-1-yl)-2-oxoethoxy)-5-chlorophenylamino)-4-(pyridin-3-ylmethylamino)cyclobut-3-ene-1,2-dione | CHEMBL397910
Type:
Small organic molecule
Emp. Form.:
C30H29ClFN5O4
Mol. Mass.:
578.034
SMILES:
C[C@@H]1CN(Cc2ccc(F)cc2)CCN1C(=O)COc1ccc(Cl)cc1Nc1c(NCc2cccnc2)c(=O)c1=O
: