Target
C-C chemokine receptor type 1
Ligand
BDBM50210977
Substrate
Meas. Tech.
ChEMBL_444181 (CHEMBL892289)
IC50
10±n/a nM
Citation
 Xie, YFLake, KLigsay, KKomandla, MSircar, INagarajan, GLi, JXu, KParise, JSchneider, LHuang, DLiu, JDines, KSakurai, NBarbosa, MJack, R Structure-activity relationships of novel, highly potent, selective, and orally active CCR1 antagonists. Bioorg Med Chem Lett 17:3367-72 (2007)  
Target
Name:
C-C chemokine receptor type 1
Synonyms:
C-C CKR-1 CC-CKR-1 CCR1 CD_antigen=CD191 CMKR1 LD78 receptor Macrophage inflammatory protein 1-alpha receptor SCYAR1
Type:
Enzyme
Mol. Mass.:
41180.69
Organism:
Homo sapiens (Human)
Description:
P32246
Residue:
355
  
Inhibitor
Name:
BDBM50210977
Synonyms:
(R)-3-(2-(2-(4-(4-fluorobenzyl)-2-methylpiperazin-1-yl)-2-oxoethoxy)-5-chlorophenylamino)-4-aminocyclobut-3-ene-1,2-dione | CHEMBL232441
Type:
Small organic molecule
Emp. Form.:
C24H24ClFN4O4
Mol. Mass.:
486.923
SMILES:
C[C@@H]1CN(Cc2ccc(F)cc2)CCN1C(=O)COc1ccc(Cl)cc1Nc1c(N)c(=O)c1=O
: