Target
Melanin-concentrating hormone receptor 1
Ligand
BDBM50211169
Substrate
Meas. Tech.
ChEMBL_455550 (CHEMBL886329)
Ki
1000±n/a nM
Citation
 Balavoine, FMalabre, PAlleaume, TRey, ACherfils, VJeanneton, OSeigneurin-Venin, SRevah, F Design and synthesis of novel hydantoin-containing melanin-concentrating hormone receptor antagonists. Bioorg Med Chem Lett 17:3754-9 (2007)  
Target
Name:
Melanin-concentrating hormone receptor 1
Synonyms:
G-protein coupled receptor 24 MCH receptor 1 MCH-R1 MCHR-1 MCHR1_HUMAN Melanin-Concentrating Hormone Receptor 1 (MCH1R) Melanin-concentrating hormone receptor 1 (MCH-1) Melanin-concentrating hormone receptor 1 (MCHR-1) SLC-1 Somatostatin receptor-like protein
Type:
G Protein-Coupled Receptor (GPCR)
Mol. Mass.:
45976.27
Organism:
Homo sapiens (Human)
Description:
Membranes from CHO-K1 cells stably expressing human MCH1R were used in assays.
Residue:
422
  
Inhibitor
Name:
BDBM50211169
Synonyms:
CHEMBL394311 | N-(3-methoxy-4-(2-(pyrrolidin-1-yl)ethoxy)phenyl)-4-(4-phenoxyphenyl)thiazol-2-amine
Type:
Small organic molecule
Emp. Form.:
C28H29N3O3S
Mol. Mass.:
487.613
SMILES:
COc1cc(Nc2nc(cs2)-c2ccc(Oc3ccccc3)cc2)ccc1OCCN1CCCC1
: