Target
Melanin-concentrating hormone receptor 1
Ligand
BDBM50150715
Substrate
Meas. Tech.
ChEMBL_455550 (CHEMBL886329)
Ki
38±n/a nM
Citation
 Balavoine, FMalabre, PAlleaume, TRey, ACherfils, VJeanneton, OSeigneurin-Venin, SRevah, F Design and synthesis of novel hydantoin-containing melanin-concentrating hormone receptor antagonists. Bioorg Med Chem Lett 17:3754-9 (2007)  
Target
Name:
Melanin-concentrating hormone receptor 1
Synonyms:
G-protein coupled receptor 24 MCH receptor 1 MCH-R1 MCHR-1 MCHR1_HUMAN Melanin-Concentrating Hormone Receptor 1 (MCH1R) Melanin-concentrating hormone receptor 1 (MCH-1) Melanin-concentrating hormone receptor 1 (MCHR-1) SLC-1 Somatostatin receptor-like protein
Type:
G Protein-Coupled Receptor (GPCR)
Mol. Mass.:
45976.27
Organism:
Homo sapiens (Human)
Description:
Membranes from CHO-K1 cells stably expressing human MCH1R were used in assays.
Residue:
422
  
Inhibitor
Name:
BDBM50150715
Synonyms:
4''-Fluoro-biphenyl-4-carboxylic acid (6-dimethylaminomethyl-5,6,7,8-tetrahydro-naphthalen-2-yl)-amide CHEMBL178707 T-226296
Type:
Small organic molecule
Emp. Form.:
C26H27FN2O
Mol. Mass.:
402.5038
SMILES:
CN(C)CC1CCc2cc(NC(=O)c3ccc(cc3)-c3ccc(F)cc3)ccc2C1
: