Target
Melanin-concentrating hormone receptor 1
Ligand
BDBM50211164
Substrate
Meas. Tech.
ChEMBL_455550 (CHEMBL886329)
Ki
220±n/a nM
Citation
 Balavoine, FMalabre, PAlleaume, TRey, ACherfils, VJeanneton, OSeigneurin-Venin, SRevah, F Design and synthesis of novel hydantoin-containing melanin-concentrating hormone receptor antagonists. Bioorg Med Chem Lett 17:3754-9 (2007)  
Target
Name:
Melanin-concentrating hormone receptor 1
Synonyms:
G-protein coupled receptor 24 MCH receptor 1 MCH-R1 MCHR-1 MCHR1_HUMAN Melanin-Concentrating Hormone Receptor 1 (MCH1R) Melanin-concentrating hormone receptor 1 (MCH-1) Melanin-concentrating hormone receptor 1 (MCHR-1) SLC-1 Somatostatin receptor-like protein
Type:
G Protein-Coupled Receptor (GPCR)
Mol. Mass.:
45976.27
Organism:
Homo sapiens (Human)
Description:
Membranes from CHO-K1 cells stably expressing human MCH1R were used in assays.
Residue:
422
  
Inhibitor
Name:
BDBM50211164
Synonyms:
(Z)-5-(4-(pyrrolidin-1-ylmethyl)benzylidene)-3-(4-phenoxyphenyl)imidazolidine-2,4-dione | CHEMBL440229
Type:
Small organic molecule
Emp. Form.:
C27H25N3O3
Mol. Mass.:
439.5057
SMILES:
O=C1N\C(=C/c2ccc(CN3CCCC3)cc2)C(=O)N1c1ccc(Oc2ccccc2)cc1
: