Target
Mitogen-activated protein kinase 10
Ligand
BDBM16015
Substrate
Meas. Tech.
ChEMBL_459041 (CHEMBL925133)
IC50
1.6±n/a nM
Citation
 Ijjaali, IPetitet, FDubus, EBarberan, OMichel, A Assessing potency of c-Jun N-terminal kinase 3 (JNK3) inhibitors using 2D molecular descriptors and binary QSAR methodology. Bioorg Med Chem 15:4256-64 (2007)  
Target
Name:
Mitogen-activated protein kinase 10
Synonyms:
JNK3 MAP kinase p49 3F12 MK10_HUMAN Mitogen-activated protein kinase 10 (Stress-activated protein kinase JNK3) (c-Jun N-terminal kinase 3) (MAP kinase p49 3F12) PRKM10 Stress-activated protein kinase JNK3 | c-Jun N-terminal kinase 3 (JNK3)
Type:
Enzyme
Mol. Mass.:
52586.89
Organism:
Homo sapiens (Human)
Description:
Residue:
464
  
Inhibitor
Name:
BDBM16015
Synonyms:
CHEMBL252967 imidazole-pyrimidine compound 1
Type:
Small organic molecule
Emp. Form.:
C25H30Cl2N6
Mol. Mass.:
485.452
SMILES:
CCCn1c(nc(c1-c1ccnc(NC2CC2)n1)-c1ccc(Cl)c(Cl)c1)C1CCN(C)CC1
: