Target
Melanocortin receptor 5
Ligand
BDBM50211397
Substrate
Meas. Tech.
ChEMBL_434973 (CHEMBL919437)
EC50
0.990000±n/a nM
Citation
 Bednarek, MAMacNeil, TTang, RFong, TMCabello, MAMaroto, MTeran, A Potent and selective agonists of human melanocortin receptor 5: cyclic analogues of alpha-melanocyte-stimulating hormone. J Med Chem 50:2520-6 (2007)  
Target
Name:
Melanocortin receptor 5
Synonyms:
MC-2 MC5R Melanocortin MC5 Melanocortin receptor 5 | Melanocortin receptor 5 (MC5R)
Type:
Enzyme
Mol. Mass.:
36612.92
Organism:
Homo sapiens (Human)
Description:
P33032
Residue:
325
  
Inhibitor
Name:
BDBM50211397
Synonyms:
Ac-Nle4-cyclo(Asp5-Oic6-D-4,4'-Bip7-Pro8-Trp9-Lys10)-NH2 | CHEMBL2371968
Type:
Small organic molecule
Emp. Form.:
C59H76N10O9
Mol. Mass.:
1069.2963
SMILES:
[H][C@@]12CC3CCCCC3N1C(=O)[C@H](CC(=O)NCCCC[C@H](NC(=O)[C@H](Cc1c[nH]c3ccccc13)NC(=O)[C@]1([H])CCCCN1C(=O)[C@H](Cc1ccc(cc1)-c1ccccc1)NC2=O)C(N)=O)NC(=O)[C@H](CCCC)NC(C)=O
: