Target
Glutamate receptor 1
Ligand
BDBM50211399
Substrate
Meas. Tech.
ChEMBL_435002 (CHEMBL920803)
Ki
7.7±n/a nM
Citation
 Vogensen, SBFrydenvang, KGreenwood, JRPostorino, GNielsen, BPickering, DSEbert, BBølcho, UEgebjerg, JGajhede, MKastrup, JSJohansen, TNClausen, RPKrogsgaard-Larsen, P A tetrazolyl-substituted subtype-selective AMPA receptor agonist. J Med Chem 50:2408-14 (2007)  
Target
Name:
Glutamate receptor 1
Synonyms:
AMPA-selective glutamate receptor 1 GluA1 GluR-A Glur1 Gria1
Type:
Protein
Mol. Mass.:
101583.91
Organism:
Rattus norvegicus (Rat)
Description:
P19490
Residue:
907
  
Inhibitor
Name:
BDBM50211399
Synonyms:
(RS)-2-amino-3-[3-hydroxy-5-(2-benzyl-2H-5-tetrazolyl)-4-isoxazolyl]propionic acid CHEMBL388746
Type:
Small organic molecule
Emp. Form.:
C14H14N6O4
Mol. Mass.:
330.2988
SMILES:
NC(Cc1c(o[nH]c1=O)-c1nnn(Cc2ccccc2)n1)C(O)=O
: