Target
Mitogen-activated protein kinase 9
Ligand
BDBM50211437
Substrate
Meas. Tech.
ChEMBL_455591 (CHEMBL886371)
IC50
177±n/a nM
Citation
 Alam, MBeevers, RECeska, TDavenport, RJDickson, KMFortunato, MGowers, LHaughan, AFJames, LAJones, MWKinsella, NLowe, CMeissner, JWNicolas, ALPerry, BGPhillips, DJPitt, WRPlatt, ARatcliffe, AJSharpe, ATait, LJ Synthesis and SAR of aminopyrimidines as novel c-Jun N-terminal kinase (JNK) inhibitors. Bioorg Med Chem Lett 17:3463-7 (2007)  
Target
Name:
Mitogen-activated protein kinase 9
Synonyms:
JNK-55 JNK2/JNK3 MK09_HUMAN Mitogen-activated protein kinase 8/9 SAPK1A c-Jun N-terminal kinase 2 | c-Jun N-terminal kinase 2 (JNK2)
Type:
Enzyme
Mol. Mass.:
48131.49
Organism:
Homo sapiens (Human)
Description:
JNK-2 was purchased from Upstate Cell Signaling Solutions (formerly Upstate Biotechnology).
Residue:
424
  
Inhibitor
Name:
BDBM50211437
Synonyms:
3-(5-chloro-4-(1H-indol-3-yl)pyrimidin-2-ylamino)-N-ethylpyrrolidine-1-carboxamide | CHEMBL246544
Type:
Small organic molecule
Emp. Form.:
C19H21ClN6O
Mol. Mass.:
384.863
SMILES:
CCNC(=O)N1CCC(C1)Nc1ncc(Cl)c(n1)-c1c[nH]c2ccccc12
: