Target
Prothrombin
Ligand
BDBM50211573
Substrate
Meas. Tech.
ChEMBL_438715 (CHEMBL889049)
Ki
3.8±n/a nM
Citation
 Dönnecke, DSchweinitz, AStürzebecher, ASteinmetzer, PSchuster, MStürzebecher, UNicklisch, SStürzebecher, JSteinmetzer, T From selective substrate analogue factor Xa inhibitors to dual inhibitors of thrombin and factor Xa. Part 3. Bioorg Med Chem Lett 17:3322-9 (2007)  
Target
Name:
Prothrombin
Synonyms:
Activation peptide fragment 1 Coagulation factor II Prothrombin precursor Thrombin heavy chain | Thrombin light chain
Type:
Protein
Mol. Mass.:
70029.57
Organism:
Homo sapiens (Human)
Description:
P00734
Residue:
622
  
Inhibitor
Name:
BDBM50211573
Synonyms:
CHEMBL390403 | ethyl 2-((R)-1-((S)-2-((2-(aminomethyl)-5-chlorobenzyl)carbamoyl)pyrrolidin-1-yl)-1-oxo-4-(pyridin-2-yl)butan-2-ylamino)acetate
Type:
Small organic molecule
Emp. Form.:
C26H34ClN5O4
Mol. Mass.:
516.032
SMILES:
CCOC(=O)CN[C@H](CCc1ccccn1)C(=O)N1CCC[C@H]1C(=O)NCc1cc(Cl)ccc1CN
: