Target
Cannabinoid receptor 1
Ligand
BDBM50211619
Substrate
Meas. Tech.
ChEMBL_455617 (CHEMBL886398)
Ki
0.9±n/a nM
Citation
 Lavey, BJKozlowski, JAShankar, BBSpitler, JMZhou, GYang, DYShu, YWong, MKWong, SCShih, NYWu, JMcCombie, SWRizvi, RWolin, RLLunn, CA Optimization of triaryl bis-sulfones as cannabinoid-2 receptor ligands. Bioorg Med Chem Lett 17:3760-4 (2007)  
Target
Name:
Cannabinoid receptor 1
Synonyms:
CANN6 CB-R CNR CNR1_HUMAN Cannabinoid receptor Cannabinoid receptor 1 (brain)
Type:
G Protein-Coupled Receptor (GPCR)
Mol. Mass.:
52868.96
Organism:
Homo sapiens (Human)
Description:
P21554
Residue:
472
  
Inhibitor
Name:
BDBM50211619
Synonyms:
(S)-N-(1-(4-(4-ethoxy-2-(2-fluorophenylsulfonyl)phenylsulfonyl)phenyl)ethyl)trifluoromethanesulfonamide | CHEMBL245782
Type:
Small organic molecule
Emp. Form.:
C23H21F4NO7S3
Mol. Mass.:
595.604
SMILES:
CCOc1ccc(c(c1)S(=O)(=O)c1ccccc1F)S(=O)(=O)c1ccc(cc1)[C@H](C)NS(=O)(=O)C(F)(F)F
: