Target
Adenosine receptor A3
Ligand
BDBM50211686
Substrate
Meas. Tech.
ChEMBL_436390 (CHEMBL904698)
Ki
>1000±n/a nM
Citation
 Vidal, BNueda, AEsteve, CDomenech, TBenito, SReinoso, RFPont, MCalbet, MLópez, RCadavid, MILoza, MICárdenas, AGodessart, NBeleta, JWarrellow, GRyder, H Discovery and characterization of 4'-(2-furyl)-N-pyridin-3-yl-4,5'-bipyrimidin-2'-amine (LAS38096), a potent, selective, and efficacious A2B adenosine receptor antagonist. J Med Chem 50:2732-6 (2007)  
Target
Name:
Adenosine receptor A3
Synonyms:
A3 adenosine receptor (hA3) ADORA3 | Adenosine A3 receptor (A3AR)
Type:
G Protein-Coupled Receptor (GPCR)
Mol. Mass.:
36197.32
Organism:
Homo sapiens (Human)
Description:
P0DMS8
Residue:
318
  
Inhibitor
Name:
BDBM50211686
Synonyms:
4'-(2-furyl)-N-pyrazin-2-yl-4,5'-bipyrimidin-2'-amine | CHEMBL226188
Type:
Small organic molecule
Emp. Form.:
C16H11N7O
Mol. Mass.:
317.3048
SMILES:
N(c1cnccn1)c1ncc(-c2ccncn2)c(n1)-c1ccco1
: