Target
Adenosine receptor A2b
Ligand
BDBM50211682
Substrate
Meas. Tech.
ChEMBL_436384 (CHEMBL904692)
Ki
16±n/a nM
Citation
 Vidal, BNueda, AEsteve, CDomenech, TBenito, SReinoso, RFPont, MCalbet, MLópez, RCadavid, MILoza, MICárdenas, AGodessart, NBeleta, JWarrellow, GRyder, H Discovery and characterization of 4'-(2-furyl)-N-pyridin-3-yl-4,5'-bipyrimidin-2'-amine (LAS38096), a potent, selective, and efficacious A2B adenosine receptor antagonist. J Med Chem 50:2732-6 (2007)  
Target
Name:
Adenosine receptor A2b
Synonyms:
AA2BR_HUMAN ADORA2B Adenosine receptors A2b | Adenosine receptors; A2a & A2b
Type:
G Protein-Coupled Receptor (GPCR)
Mol. Mass.:
36341.22
Organism:
Homo sapiens (Human)
Description:
Residue:
332
  
Inhibitor
Name:
BDBM50211682
Synonyms:
5-{[4'-(2-furyl)-4,5'-bipyrimidin-2'-yl]amino}pyridin-2(1H)-one | CHEMBL226238
Type:
Small organic molecule
Emp. Form.:
C17H12N6O2
Mol. Mass.:
332.3162
SMILES:
O=c1ccc(Nc2ncc(-c3ccncn3)c(n2)-c2ccco2)c[nH]1
: