Target
cGMP-dependent protein kinase
Ligand
BDBM50211814
Substrate
Meas. Tech.
ChEMBL_447195 (CHEMBL897494)
IC50
0.05±n/a nM
Citation
 Liang, GBQian, XFeng, DFisher, MBrown, CMGurnett, ALeavitt, PSLiberator, PAMisura, ASTamas, TSchmatz, DMWyvratt, MBiftu, T Synthesis and SAR studies of potent imidazopyridine anticoccidial agents. Bioorg Med Chem Lett 17:3558-61 (2007)  
Target
Name:
cGMP-dependent protein kinase
Synonyms:
Type:
PROTEIN
Mol. Mass.:
112911.27
Organism:
Eimeria tenella
Description:
ChEMBL_469577
Residue:
1003
  
Inhibitor
Name:
BDBM50211814
Synonyms:
4-(2-(4-fluorophenyl)-7-((isopropylamino)methyl)H-imidazo[1,2-a]pyridin-3-yl)-N-((S)-1-phenylethyl)pyrimidin-2-amine | CHEMBL428900
Type:
Small organic molecule
Emp. Form.:
C29H29FN6
Mol. Mass.:
480.5792
SMILES:
CC(C)NCc1ccn2c(c(nc2c1)-c1ccc(F)cc1)-c1ccnc(N[C@@H](C)c2ccccc2)n1
: