Target
Estrogen receptor beta
Ligand
BDBM50212156
Substrate
Meas. Tech.
ChEMBL_438781 (CHEMBL889119)
Ki
4.19±n/a nM
Citation
 Richardson, TIFrank, SAWang, MClarke, CAJones, SAYing, BPKohlman, DTWallace, OBShepherd, TADally, RDPalkowitz, ADGeiser, AGBryant, HUHenck, JWCohen, IRRudmann, DGMcCann, DJCoutant, DEOldham, SWHummel, CWFong, KCHinklin, RLewis, GTian, HDodge, JA Structure-activity relationships of SERMs optimized for uterine antagonism and ovarian safety. Bioorg Med Chem Lett 17:3544-9 (2007)  
Target
Name:
Estrogen receptor beta
Synonyms:
ER-beta ESR2_HUMAN Estradiol receptor beta (ERβ) Estrogen receptor (ER beta) Estrogen receptor beta (ER beta) NR3A2 estrogen beta
Type:
Protein
Mol. Mass.:
59238.43
Organism:
Homo sapiens (Human)
Description:
Q92731
Residue:
530
  
Inhibitor
Name:
BDBM50212156
Synonyms:
6-(4-(ethylsulfonyl)phenyl)-5-(4-(2-(piperidin-1-yl)ethoxy)phenoxy)naphthalen-2-ol | CHEMBL243790
Type:
Small organic molecule
Emp. Form.:
C31H33NO5S
Mol. Mass.:
531.662
SMILES:
CCS(=O)(=O)c1ccc(cc1)-c1ccc2cc(O)ccc2c1Oc1ccc(OCCN2CCCCC2)cc1
: