Target
Estrogen receptor
Ligand
BDBM19966
Substrate
Meas. Tech.
ChEMBL_438780 (CHEMBL889118)
Ki
0.47±n/a nM
Citation
 Richardson, TIFrank, SAWang, MClarke, CAJones, SAYing, BPKohlman, DTWallace, OBShepherd, TADally, RDPalkowitz, ADGeiser, AGBryant, HUHenck, JWCohen, IRRudmann, DGMcCann, DJCoutant, DEOldham, SWHummel, CWFong, KCHinklin, RLewis, GTian, HDodge, JA Structure-activity relationships of SERMs optimized for uterine antagonism and ovarian safety. Bioorg Med Chem Lett 17:3544-9 (2007)  
Target
Name:
Estrogen receptor
Synonyms:
ER ESR ESR1_HUMAN Estrogen receptor Estrogen receptor (ER-alpha) Estrogen receptor alpha (ER) Nuclear receptor subfamily 3 group A member 1
Type:
Protein
Mol. Mass.:
66230.44
Organism:
Homo sapiens (Human)
Description:
P03372
Residue:
595
  
Inhibitor
Name:
BDBM19966
Synonyms:
6-(4-methanesulfonylphenyl)-5-{4-[2-(piperidin-1-yl)ethoxy]phenoxy}naphthalen-2-ol CHEMBL243789 LY2066948
Type:
Small organic molecule
Emp. Form.:
C30H31NO5S
Mol. Mass.:
517.636
SMILES:
CS(=O)(=O)c1ccc(cc1)-c1ccc2cc(O)ccc2c1Oc1ccc(OCCN2CCCCC2)cc1
: