Target
Steroid hormone receptor ERR1
Ligand
BDBM50212167
Substrate
Meas. Tech.
ChEMBL_455655 (CHEMBL886438)
IC50
86±n/a nM
Citation
 Vu, ATCampbell, ANHarris, HAUnwalla, RJManas, ESMewshaw, RE ERbeta ligands. Part 6: 6H-Chromeno[4,3-b]quinolines as a new series of estrogen receptor beta-selective ligands. Bioorg Med Chem Lett 17:4053-6 (2007)  
Target
Name:
Steroid hormone receptor ERR1
Synonyms:
ERR-alpha ERR1_HUMAN ESRRA Estrogen-Related Receptor, alpha NR3B1 Steroid hormone receptor ERR1 Steroid hormone receptor ERR1/Estrogen-related receptor alpha (ERRa) | von Hippel-Lindau disease tumor suppressor/Steroid hormone receptor ERR1
Type:
PROTEIN
Mol. Mass.:
45508.08
Organism:
Homo sapiens (Human)
Description:
ChEMBL_1499891
Residue:
423
  
Inhibitor
Name:
BDBM50212167
Synonyms:
7-(3-methoxyphenyl)-6H-chromeno[4,3-b]quinoline-3,9-diol | CHEMBL398815
Type:
Small organic molecule
Emp. Form.:
C23H17NO4
Mol. Mass.:
371.3854
SMILES:
COc1cccc(c1)-c1c2COc3cc(O)ccc3-c2nc2ccc(O)cc12
: