Target
Steroid hormone receptor ERR1
Ligand
BDBM50212168
Substrate
Meas. Tech.
ChEMBL_455655 (CHEMBL886438)
IC50
65±n/a nM
Citation
 Vu, ATCampbell, ANHarris, HAUnwalla, RJManas, ESMewshaw, RE ERbeta ligands. Part 6: 6H-Chromeno[4,3-b]quinolines as a new series of estrogen receptor beta-selective ligands. Bioorg Med Chem Lett 17:4053-6 (2007)  
Target
Name:
Steroid hormone receptor ERR1
Synonyms:
ERR-alpha ERR1_HUMAN ESRRA Estrogen-Related Receptor, alpha NR3B1 Steroid hormone receptor ERR1 Steroid hormone receptor ERR1/Estrogen-related receptor alpha (ERRa) | von Hippel-Lindau disease tumor suppressor/Steroid hormone receptor ERR1
Type:
PROTEIN
Mol. Mass.:
45508.08
Organism:
Homo sapiens (Human)
Description:
ChEMBL_1499891
Residue:
423
  
Inhibitor
Name:
BDBM50212168
Synonyms:
4-(3,9-dihydroxy-6H-chromeno[4,3-b]quinolin-7-yl)benzonitrile | CHEMBL437390
Type:
Small organic molecule
Emp. Form.:
C23H14N2O3
Mol. Mass.:
366.3689
SMILES:
Oc1ccc-2c(OCc3c-2nc2ccc(O)cc2c3-c2ccc(cc2)C#N)c1
: