Target
Isoform 1 of Steroid hormone receptor ERR2 (ERRbeta2-delta10)
Ligand
BDBM50212168
Substrate
Meas. Tech.
ChEMBL_455656 (CHEMBL886439)
IC50
1017±n/a nM
Citation
 Vu, ATCampbell, ANHarris, HAUnwalla, RJManas, ESMewshaw, RE ERbeta ligands. Part 6: 6H-Chromeno[4,3-b]quinolines as a new series of estrogen receptor beta-selective ligands. Bioorg Med Chem Lett 17:4053-6 (2007)  
Target
Name:
Isoform 1 of Steroid hormone receptor ERR2 (ERRbeta2-delta10)
Synonyms:
ERR beta-2 ERR2_HUMAN ESRL2 Estrogen receptor-like 2 Estrogen-related receptor, beta Nuclear receptor subfamily 3 group B member 2 Steroid hormone receptor ERR2 (ERRbeta2-delta10)
Type:
PROTEIN
Mol. Mass.:
56220.72
Organism:
Homo sapiens (Human)
Description:
ChEMBL_940755
Residue:
508
  
Inhibitor
Name:
BDBM50212168
Synonyms:
4-(3,9-dihydroxy-6H-chromeno[4,3-b]quinolin-7-yl)benzonitrile | CHEMBL437390
Type:
Small organic molecule
Emp. Form.:
C23H14N2O3
Mol. Mass.:
366.3689
SMILES:
Oc1ccc-2c(OCc3c-2nc2ccc(O)cc2c3-c2ccc(cc2)C#N)c1
: