Target
Proteinase-activated receptor 1
Ligand
BDBM50212450
Substrate
Meas. Tech.
ChEMBL_447297 (CHEMBL896330)
IC50
225±n/a nM
Citation
 Clasby, MCChackalamannil, SCzarniecki, MDoller, DEagen, KGreenlee, WJLin, YTagat, JRTsai, HXia, YAhn, HSAgans-Fantuzzi, JBoykow, GChintala, MHsieh, YMcPhail, AT Himbacine derived thrombin receptor antagonists: discovery of a new tricyclic core. Bioorg Med Chem Lett 17:3647-51 (2007)  
Target
Name:
Proteinase-activated receptor 1
Synonyms:
CF2R F2R PAR1 Proteinase activated receptor 1 TR Thrombin receptor/ Proteinase-activated receptor 1(Par-1)
Type:
Protein
Mol. Mass.:
47450.07
Organism:
Homo sapiens (Human)
Description:
P25116
Residue:
425
  
Inhibitor
Name:
BDBM50212450
Synonyms:
(3aS,4S,9aR,E)-4-(2-(6-methoxyquinolin-2-yl)vinyl)-3,3-dimethyl-3a,4,9,9a-tetrahydronaphtho[2,3-c]furan-1(3H)-one | CHEMBL391324
Type:
Small organic molecule
Emp. Form.:
C26H25NO3
Mol. Mass.:
399.4816
SMILES:
COc1ccc2nc(\C=C\[C@H]3[C@H]4[C@@H](Cc5ccccc35)C(=O)OC4(C)C)ccc2c1
: