Target
Proteinase-activated receptor 1
Ligand
BDBM50212452
Substrate
Meas. Tech.
ChEMBL_447297 (CHEMBL896330)
IC50
330±n/a nM
Citation
 Clasby, MCChackalamannil, SCzarniecki, MDoller, DEagen, KGreenlee, WJLin, YTagat, JRTsai, HXia, YAhn, HSAgans-Fantuzzi, JBoykow, GChintala, MHsieh, YMcPhail, AT Himbacine derived thrombin receptor antagonists: discovery of a new tricyclic core. Bioorg Med Chem Lett 17:3647-51 (2007)  
Target
Name:
Proteinase-activated receptor 1
Synonyms:
CF2R F2R PAR1 Proteinase activated receptor 1 TR Thrombin receptor/ Proteinase-activated receptor 1(Par-1)
Type:
Protein
Mol. Mass.:
47450.07
Organism:
Homo sapiens (Human)
Description:
P25116
Residue:
425
  
Inhibitor
Name:
BDBM50212452
Synonyms:
(3aR,4R,9aS,E)-4-(2-(5-(3-chlorophenyl)pyridin-2-yl)vinyl)-5-fluoro-3a,4,9,9a-tetrahydronaphtho[2,3-c]furan-1(3H)-one | CHEMBL231732
Type:
Small organic molecule
Emp. Form.:
C25H19ClFNO2
Mol. Mass.:
419.875
SMILES:
Fc1cccc2C[C@H]3[C@H](COC3=O)[C@@H](\C=C\c3ccc(cn3)-c3cccc(Cl)c3)c12
: