Target
Serine/threonine-protein kinase Chk1
Ligand
BDBM50212489
Substrate
Meas. Tech.
ChEMBL_447306 (CHEMBL896339)
IC50
7.7±n/a nM
Citation
 Tong, YClaiborne, APyzytulinska, MTao, ZFStewart, KDKovar, PChen, ZCredo, RBGuan, RMerta, PJZhang, HBouska, JEveritt, EAMurry, BPHickman, DStratton, TJWu, JRosenberg, SHSham, HLSowin, TJLin, NH 1,4-Dihydroindeno[1,2-c]pyrazoles as potent checkpoint kinase 1 inhibitors: extended exploration on phenyl ring substitutions and preliminary ADME/PK studies. Bioorg Med Chem Lett 17:3618-23 (2007)  
Target
Name:
Serine/threonine-protein kinase Chk1
Synonyms:
CHEK1 CHK1 checkpoint homolog Checkpoint kinase-1 (CHK1)
Type:
Enzyme Catalytic Domain
Mol. Mass.:
54443.02
Organism:
Homo sapiens (Human)
Description:
gi_166295192
Residue:
476
  
Inhibitor
Name:
BDBM50212489
Synonyms:
4'-(6-(hydroxymethyl)-1,4-dihydroindeno[1,2-c]pyrazol-3-yl)biphenyl-4-ol CHEMBL391450
Type:
Small organic molecule
Emp. Form.:
C23H18N2O2
Mol. Mass.:
354.4012
SMILES:
OCc1ccc-2c(Cc3c-2[nH]nc3-c2ccc(cc2)-c2ccc(O)cc2)c1
: