Target
Histamine H3 receptor
Ligand
BDBM50212733
Substrate
Meas. Tech.
ChEMBL_438820 (CHEMBL887978)
Ki
9.8±n/a nM
Citation
 Roche, ORodríguez Sarmiento, RM A new class of histamine H3 receptor antagonists derived from ligand based design. Bioorg Med Chem Lett 17:3670-5 (2007)  
Target
Name:
Histamine H3 receptor
Synonyms:
HH3R Hrh3
Type:
G Protein-Coupled Receptor (GPCR)
Mol. Mass.:
48607.98
Organism:
Rattus norvegicus (rat)
Description:
Residue:
445
  
Inhibitor
Name:
BDBM50212733
Synonyms:
CHEMBL425994 | N-(2-((dimethylamino)methyl)-4-(3-(piperidin-1-yl)propoxy)phenyl)quinazolin-4-amine
Type:
Small organic molecule
Emp. Form.:
C25H33N5O
Mol. Mass.:
419.5624
SMILES:
CN(C)Cc1cc(OCCCN2CCCCC2)ccc1Nc1ncnc2ccccc12
: