Target
Vascular endothelial growth factor receptor 1
Ligand
BDBM50212764
Substrate
Meas. Tech.
ChEMBL_447355 (CHEMBL895283)
IC50
>10000±n/a nM
Citation
 Snow, RJAbeywardane, ACampbell, SLord, JKashem, MAKhine, HHKing, JKowalski, JAPullen, SSRoma, TRoth, GPSarko, CRWilson, NSWinters, MPWolak, JPCywin, CL Hit-to-lead studies on benzimidazole inhibitors of ITK: discovery of a novel class of kinase inhibitors. Bioorg Med Chem Lett 17:3660-5 (2007)  
Target
Name:
Vascular endothelial growth factor receptor 1
Synonyms:
FLT FRT Fms-like tyrosine kinase 1 Tyrosine-protein kinase FRT VEGFR-1 VGFR1_HUMAN Vascular endothelial growth factor receptor 1 (FLT1) Vascular endothelial growth factor receptor 1 and 2 (Flt-1 and KDR) Vascular permeability factor receptor vascular endothelial growth factor/vascular permeability factor receptor
Type:
Receptor Tyrosine Kinase
Mol. Mass.:
150800.23
Organism:
Homo sapiens (Human)
Description:
P17948
Residue:
1338
  
Inhibitor
Name:
BDBM50212764
Synonyms:
CHEMBL233338 | N-(1-(3-aminopropyl)-5-(N-methylcyclohexanecarboxamido)-1H-benzo[d]imidazol-2-yl)thiophene-2-carboxamide
Type:
Small organic molecule
Emp. Form.:
C23H29N5O2S
Mol. Mass.:
439.574
SMILES:
CN(C(=O)C1CCCCC1)c1ccc2n(CCCN)c(NC(=O)c3cccs3)nc2c1
: