Target
Tyrosine-protein kinase ITK/TSK
Ligand
BDBM50212790
Substrate
Meas. Tech.
ChEMBL_447339 (CHEMBL896373)
IC50
730±n/a nM
Citation
 Snow, RJAbeywardane, ACampbell, SLord, JKashem, MAKhine, HHKing, JKowalski, JAPullen, SSRoma, TRoth, GPSarko, CRWilson, NSWinters, MPWolak, JPCywin, CL Hit-to-lead studies on benzimidazole inhibitors of ITK: discovery of a novel class of kinase inhibitors. Bioorg Med Chem Lett 17:3660-5 (2007)  
Target
Name:
Tyrosine-protein kinase ITK/TSK
Synonyms:
EMT ITK_HUMAN LYK Tyrosine-protein kinase ITK Tyrosine-protein kinase Lyk
Type:
Protein
Mol. Mass.:
71839.20
Organism:
Homo sapiens (Human)
Description:
Q08881
Residue:
620
  
Inhibitor
Name:
BDBM50212790
Synonyms:
CHEMBL232157 | N-allyl-1-(3-amino-3-oxopropyl)-2-benzamido-N-cyclohexyl-1H-benzo[d]imidazole-5-carboxamide
Type:
Small organic molecule
Emp. Form.:
C27H31N5O3
Mol. Mass.:
473.5667
SMILES:
NC(=O)CCn1c(NC(=O)c2ccccc2)nc2cc(ccc12)C(=O)N(CC=C)C1CCCCC1
: