Target
Fatty acid-binding protein, adipocyte
Ligand
BDBM60927
Substrate
Meas. Tech.
ChEMBL_455936 (CHEMBL887937)
Ki
1000±n/a nM
Citation
 Sulsky, RMagnin, DRHuang, YSimpkins, LTaunk, PPatel, MZhu, YStouch, TRBassolino-Klimas, DParker, RHarrity, TStoffel, RTaylor, DSLavoie, TBKish, KJacobson, BLSheriff, SAdam, LPEwing, WRRobl, JA Potent and selective biphenyl azole inhibitors of adipocyte fatty acid binding protein (aFABP). Bioorg Med Chem Lett 17:3511-5 (2007)  
Target
Name:
Fatty acid-binding protein, adipocyte
Synonyms:
A-FABP ALBP FABP4 Fatty acid binding protein adipocyte Fatty acid-binding protein 4 (FABP4)
Type:
Enzyme
Mol. Mass.:
14719.23
Organism:
Homo sapiens (Human)
Description:
P15090
Residue:
132
  
Inhibitor
Name:
BDBM60927
Synonyms:
1-anilinonaphthalene-8-sulfonic acid ANS BDBM50126831
Type:
Emp. Form.:
C16H13NO3S
Mol. Mass.:
299.344
SMILES:
OS(=O)(=O)c1cccc2cccc(Nc3ccccc3)c12
: