Target
Fatty acid-binding protein, adipocyte
Ligand
BDBM50212881
Substrate
Meas. Tech.
ChEMBL_455936 (CHEMBL887937)
Ki
13±n/a nM
Citation
 Sulsky, RMagnin, DRHuang, YSimpkins, LTaunk, PPatel, MZhu, YStouch, TRBassolino-Klimas, DParker, RHarrity, TStoffel, RTaylor, DSLavoie, TBKish, KJacobson, BLSheriff, SAdam, LPEwing, WRRobl, JA Potent and selective biphenyl azole inhibitors of adipocyte fatty acid binding protein (aFABP). Bioorg Med Chem Lett 17:3511-5 (2007)  
Target
Name:
Fatty acid-binding protein, adipocyte
Synonyms:
A-FABP ALBP FABP4 Fatty acid binding protein adipocyte Fatty acid-binding protein 4 (FABP4)
Type:
Enzyme
Mol. Mass.:
14719.23
Organism:
Homo sapiens (Human)
Description:
P15090
Residue:
132
  
Inhibitor
Name:
BDBM50212881
Synonyms:
CHEMBL396698 | [2'-(1-methyl-4,5-diphenyl-1H-imidazol-2-yl)-biphenyl-3-yloxy]-acetic acid
Type:
Small organic molecule
Emp. Form.:
C30H24N2O3
Mol. Mass.:
460.5232
SMILES:
Cn1c(nc(c1-c1ccccc1)-c1ccccc1)-c1ccccc1-c1cccc(OCC(O)=O)c1
: