Target
Dipeptidyl peptidase 9
Ligand
BDBM11162
Substrate
Meas. Tech.
ChEMBL_447407 (CHEMBL896431)
IC50
>100000±n/a nM
Citation
 Gao, YDFeng, DSheridan, RPScapin, GPatel, SBWu, JKZhang, XSinha-Roy, RThornberry, NAWeber, AEBiftu, T Modeling assisted rational design of novel, potent, and selective pyrrolopyrimidine DPP-4 inhibitors. Bioorg Med Chem Lett 17:3877-9 (2007)  
Target
Name:
Dipeptidyl peptidase 9
Synonyms:
DPP9 DPRP-2 Dipeptidyl peptidase 9 (DDP9) Dipeptidyl peptidase 9 (DPP9) Dipeptidyl peptidase IX Dipeptidyl peptidase-like protein 9
Type:
Enzyme
Mol. Mass.:
98260.70
Organism:
Homo sapiens (Human)
Description:
Q86TI2
Residue:
863
  
Inhibitor
Name:
BDBM11162
Synonyms:
(1R)-3-oxo-3-[3-(trifluoroethyl)-5,6-dihydro[1,2,4]triazolo[4,3-a]pyrazin-7(8H)-yl]-1-(2,4,5-trifluorobenzyl)propylamine CHEMBL393336 Sitagliptin Triazolopiperazine Analogue 1 | US10479798, Compound MK0431
Type:
Small organic molecule
Emp. Form.:
C16H15F6N5O
Mol. Mass.:
407.3136
SMILES:
N[C@@H](CC(=O)N1CCn2c(C1)nnc2C(F)(F)F)Cc1cc(F)c(F)cc1F
: