Target
Kappa-type opioid receptor
Ligand
BDBM50213388
Substrate
Meas. Tech.
ChEMBL_447458 (CHEMBL896481)
Ki
366±n/a nM
Citation
 Trabanco, AAAerts, NAlvarez, RMAndrés, JIBoeckx, IFernández, JGómez, AJanssens, FELeenaerts, JEDe Lucas, AIMatesanz, ESteckler, TPullan, S 4-Phenyl-4-[1H-imidazol-2-yl]-piperidine derivatives as non-peptidic selective delta-opioid agonists with potential anxiolytic/antidepressant properties. Part 2. Bioorg Med Chem Lett 17:3860-3 (2007)  
Target
Name:
Kappa-type opioid receptor
Synonyms:
K-OR-1 Kappa-opioid receptor (KOR) Kappa-type opioid receptor (KOR) OPIATE Kappa OPRK1 kappa opioid receptor (KOR)
Type:
G Protein-Coupled Receptor (GPCR)
Mol. Mass.:
42648.76
Organism:
Homo sapiens (Human)
Description:
P41145
Residue:
380
  
Inhibitor
Name:
BDBM50213388
Synonyms:
CHEMBL233570 | ethyl 4-(1-(3-methoxybenzyl)-1H-imidazol-2-yl)-4-phenylpiperidine-1-carboxylate
Type:
Small organic molecule
Emp. Form.:
C25H29N3O3
Mol. Mass.:
419.5161
SMILES:
CCOC(=O)N1CCC(CC1)(c1nccn1Cc1cccc(OC)c1)c1ccccc1
: