Target
Kappa-type opioid receptor
Ligand
BDBM50213393
Substrate
Meas. Tech.
ChEMBL_447458 (CHEMBL896481)
Ki
88±n/a nM
Citation
 Trabanco, AAAerts, NAlvarez, RMAndrés, JIBoeckx, IFernández, JGómez, AJanssens, FELeenaerts, JEDe Lucas, AIMatesanz, ESteckler, TPullan, S 4-Phenyl-4-[1H-imidazol-2-yl]-piperidine derivatives as non-peptidic selective delta-opioid agonists with potential anxiolytic/antidepressant properties. Part 2. Bioorg Med Chem Lett 17:3860-3 (2007)  
Target
Name:
Kappa-type opioid receptor
Synonyms:
K-OR-1 Kappa-opioid receptor (KOR) Kappa-type opioid receptor (KOR) OPIATE Kappa OPRK1 kappa opioid receptor (KOR)
Type:
G Protein-Coupled Receptor (GPCR)
Mol. Mass.:
42648.76
Organism:
Homo sapiens (Human)
Description:
P41145
Residue:
380
  
Inhibitor
Name:
BDBM50213393
Synonyms:
CHEMBL232548 | methyl 4-((2-(1-benzoyl-4-phenylpiperidin-4-yl)-1H-imidazol-1-yl)methyl)benzoate
Type:
Small organic molecule
Emp. Form.:
C30H29N3O3
Mol. Mass.:
479.5696
SMILES:
COC(=O)c1ccc(Cn2ccnc2C2(CCN(CC2)C(=O)c2ccccc2)c2ccccc2)cc1
: