Target
Mu-type opioid receptor
Ligand
BDBM50213373
Substrate
Meas. Tech.
ChEMBL_447457 (CHEMBL896480)
Ki
>465±n/a nM
Citation
 Trabanco, AAAerts, NAlvarez, RMAndrés, JIBoeckx, IFernández, JGómez, AJanssens, FELeenaerts, JEDe Lucas, AIMatesanz, ESteckler, TPullan, S 4-Phenyl-4-[1H-imidazol-2-yl]-piperidine derivatives as non-peptidic selective delta-opioid agonists with potential anxiolytic/antidepressant properties. Part 2. Bioorg Med Chem Lett 17:3860-3 (2007)  
Target
Name:
Mu-type opioid receptor
Synonyms:
M-OR-1 MOR-1 MUOR1 Mu opiate receptor OPRM1 hMOP | mu-type opioid receptor isoform MOR-1
Type:
G Protein-Coupled Receptor (GPCR)
Mol. Mass.:
44789.51
Organism:
Homo sapiens (Human)
Description:
P35372
Residue:
400
  
Inhibitor
Name:
BDBM50213373
Synonyms:
(4-(1-benzyl-1H-imidazol-2-yl)-4-phenylpiperidin-1-yl)(3,5-dimethylphenyl)methanone | CHEMBL392478
Type:
Small organic molecule
Emp. Form.:
C30H31N3O
Mol. Mass.:
449.5866
SMILES:
Cc1cc(C)cc(c1)C(=O)N1CCC(CC1)(c1nccn1Cc1ccccc1)c1ccccc1
: