Target
Kappa-type opioid receptor
Ligand
BDBM50213374
Substrate
Meas. Tech.
ChEMBL_447458 (CHEMBL896481)
Ki
334±n/a nM
Citation
 Trabanco, AAAerts, NAlvarez, RMAndrés, JIBoeckx, IFernández, JGómez, AJanssens, FELeenaerts, JEDe Lucas, AIMatesanz, ESteckler, TPullan, S 4-Phenyl-4-[1H-imidazol-2-yl]-piperidine derivatives as non-peptidic selective delta-opioid agonists with potential anxiolytic/antidepressant properties. Part 2. Bioorg Med Chem Lett 17:3860-3 (2007)  
Target
Name:
Kappa-type opioid receptor
Synonyms:
K-OR-1 Kappa-opioid receptor (KOR) Kappa-type opioid receptor (KOR) OPIATE Kappa OPRK1 kappa opioid receptor (KOR)
Type:
G Protein-Coupled Receptor (GPCR)
Mol. Mass.:
42648.76
Organism:
Homo sapiens (Human)
Description:
P41145
Residue:
380
  
Inhibitor
Name:
BDBM50213374
Synonyms:
CHEMBL437397 | phenyl(4-phenyl-4-(1-(1-phenylethyl)-1H-imidazol-2-yl)piperidin-1-yl)methanone
Type:
Small organic molecule
Emp. Form.:
C29H29N3O
Mol. Mass.:
435.5601
SMILES:
CC(c1ccccc1)n1ccnc1C1(CCN(CC1)C(=O)c1ccccc1)c1ccccc1
: