Target
Alpha-1D adrenergic receptor
Ligand
BDBM50213516
Substrate
Meas. Tech.
ChEMBL_438894 (CHEMBL889237)
Ki
3±n/a nM
Citation
 Chiu, GLi, SConnolly, PJPulito, VLiu, JMiddleton, SA (Phenylpiperidinyl)cyclohexylsulfonamides: development of alpha1a/1d-selective adrenergic receptor antagonists for the treatment of benign prostatic hyperplasia/lower urinary tract symptoms (BPH/LUTS). Bioorg Med Chem Lett 17:3930-4 (2007)  
Target
Name:
Alpha-1D adrenergic receptor
Synonyms:
ADA1D_HUMAN ADRA1D Adrenergic receptor alpha Alpha 1D-adrenoreceptor Alpha-1D adrenoceptor adrenergic Alpha1D
Type:
Enzyme Catalytic Domain
Mol. Mass.:
60485.82
Organism:
Homo sapiens (Human)
Description:
adrenergic Alpha1D ADRA1D HUMAN::P25100
Residue:
572
  
Inhibitor
Name:
BDBM50213516
Synonyms:
CHEMBL439197 | N-((1s,4s)-4-(4-(2-(2,2,2-trifluoroethoxy)phenyl)piperidin-1-yl)cyclohexyl)-2,3-dihydrobenzo[b][1,4]dioxine-6-sulfonamide
Type:
Small organic molecule
Emp. Form.:
C27H33F3N2O5S
Mol. Mass.:
554.622
SMILES:
FC(F)(F)COc1ccccc1C1CCN(CC1)[C@@H]1CC[C@@H](CC1)NS(=O)(=O)c1ccc2OCCOc2c1
: