Target
Cannabinoid receptor 1
Ligand
BDBM50130623
Substrate
Meas. Tech.
ChEMBL_459063 (CHEMBL925155)
Ki
0.45±n/a nM
Citation
 Durdagi, SKapou, AKourouli, TAndreou, TNikas, SPNahmias, VRPapahatjis, DPPapadopoulos, MGMavromoustakos, T The application of 3D-QSAR studies for novel cannabinoid ligands substituted at the C1' position of the alkyl side chain on the structural requirements for binding to cannabinoid receptors CB1 and CB2. J Med Chem 50:2875-85 (2007)  
Target
Name:
Cannabinoid receptor 1
Synonyms:
CANN6 CB-R CNR CNR1_HUMAN Cannabinoid receptor Cannabinoid receptor 1 (brain)
Type:
G Protein-Coupled Receptor (GPCR)
Mol. Mass.:
52868.96
Organism:
Homo sapiens (Human)
Description:
P21554
Residue:
472
  
Inhibitor
Name:
BDBM50130623
Synonyms:
(6aR,10aR)-3-(1-hexylcyclopentyl)-6,6,9-trimethyl-6a,7,10,10a-tetrahydro-6H-benzo[c]chromen-1-ol CHEMBL108868
Type:
Small organic molecule
Emp. Form.:
C27H40O2
Mol. Mass.:
396.6053
SMILES:
CCCCCCC1(CCCC1)c1cc(O)c2[C@@H]3CC(C)=CC[C@H]3C(C)(C)Oc2c1
: